�S���n�������c�̃R�[�h,ID,�n�������c�̖�,����,����_�J�i,����_�ʏ�,����_�p��,����������,���,�ꏊ����,���ݒn_�S���n�������c�̃R�[�h,����ID,���ݒn_�A���\�L,���ݒn_�s���{��,���ݒn_�s�撬��,���ݒn_����,���ݒn_�Ԓn�ȉ�,��������(����),�ܓx,�o�x,���x�̎��,���x�̒l,�d�b�ԍ�,�����ԍ�,�A���惁�[���A�h���X,�A����FormURL,�A������l�i���̑��ASNS�Ȃǁj,�X�֔ԍ�,�����i���j,�����i�P�ʁj,�@�l�ԍ�,���L�ғ�,�������w���,���p�\�j��,�J�n����,�I������,���p�\�������L����,�摜,�摜_���C�Z���X,�T�v,�T�v_�p��,����,����_�p��,URL,���l
122033,,�s��s,��铔,�W���E���g�E,,,�s�w��L�`������,������,,122033,,��t���s��s�{�s��34�n��,��t��,�s��s,�{�s��,34,�n��,35.69096131,139.9149073,,,,,,,,,,,,�s��s,22196,,,,,,,,,,,,
122033,,�s��s,�@�_��,�Y�C�V������,,,�s�w��L�`������,������,,122033,,��t���s��s����4����1-7,��t��,�s��s,����4����,1-7,,35.72331197,139.9305164,,,,,,,,,,,,���������{,22196,,,,,,,,,,,,
122033,,�s��s,����V�v�ȕ�΁E���{���@������V����,�J�m�E�W���E�e���t�T�C�{�Z�L�E�N���E�g�E�c�P�^���J�m�E�W���E�e���R�c�c�{,,,�s�w��L�`������,"������
���j����",,122033,,��t���s��s����1����16-26���S��,��t��,�s��s,����1����,16-26,���S��,35.68133447,139.9035289,,,,,,,,,,,,"����A
���j������",22313,,,,,,,,,,,,���ɂ��Ă�S63.7.5�Ɏw��
122033,,�s��s,���O�̔�,�Q���R�E�m�C�^�r,,,�s�w��L�`������,������,,122033,,��t���s��s���ΐ_21-9�ו���,��t��,�s��s,���ΐ_,21-9,�ו���,35.71958153,139.9435906,,,,,,,,,,,,�`����,22313,,,,,,,,,,,,
122033,,�s��s,�ؒ����@����,���N�`���E�j�`�����U�]�E,,,�s�w��L�`������,���p�H�|�i�E����,,122033,,��t���s��s���䒬1����1696���s��,��t��,�s��s,���䒬1����,1696,���s��,35.73656583,139.9710689,,,,,,,,,,,,���s��,22542,,,,,,,,,,,,
122033,,�s��s,�@�،o������@�����c�����M�G�z,�z�P�L���E�W�N�������c�P�^���I�I�^�X�P�m�u�q�c�w���K�N,,,�s�w��L�`������,������,,122033,,��t���s��s���R4����15-18,��t��,�s��s,���R4����,15-18,,35.71697689,139.9454652,,,,,,,,,,,,�@�،o��,22594,,,,,,,,,,,,
122033,,�s��s,�{����ƕ�����,�z���A�~�P�u���R�c�{,,,�s�w��L�`������,������,,122033,,��t���s��s���R2����10-1�@�،o��,��t��,�s��s,���R2����,10-1,�@�،o��,35.71967089,139.9476979,,,,,,,,,,,,�@�،o��,22594,,,,,,,,,,,,
122033,,�s��s,���x�M�G�z�@���u�ʖ{�v,�R�E�G�c�q�c�w���K�N�c�P�^���c�E�z��,,,�s�w��L�`������,���p�H�|�i�E����,,122033,,��t���s��s���R2����10-1�@�،o��,��t��,�s��s,���R2����,10-1,�@�،o��,35.72087589,139.9491112,,,,,,,,,,,,�@�،o��,22594,,,,,,,,,,,,���ɂ��Ă�S54.9.27�w��
122033,,�s��s,���ˌÕ��Ί�,�A�P�h�R�t���Z�L�J��,,,�s�w��L�`������,������,,122033,,��t���s��s���{��3����9����������,��t��,�s��s,���{��3����,9,����������,35.74853372,139.8983222,,,,,,,,,,,,�s��s,22808,,,,,,,,,,,,
122033,,�s��s,������񉤑�,�W���E�R�E�W�j�I�E�]�E,,,�s�w��L�`������,���p�H�|�i�E����,,122033,,��t���s��s��쒬3����1917�����,��t��,�s��s,��쒬3����,1917,�����,35.75408319,139.9552203,,,,,,,,,,,,�����,23803,,,,,,,,,,,,
122033,,�s��s,���D���R��,�~���E�R�E�W�T������,,,�s�w��L�`������,������,,122033,,��t���s��s���T1����11-10���D��,��t��,�s��s,���T1����,11-10,���D��,35.69763669,139.9254709,,,,,,,,,,,,���D��,24895,,,,,,,,,,,,
122033,,�s��s,���}�����M�v�ȋ��{��,�I�K�T�����}�T�m�u�t�T�C�N���E�g�E,,,�s�w��L�`������,������,,122033,,��t���s��s���{��3����10-1���J��,��t��,�s��s,���{��3����,10-1,���J��,35.74809433,139.8999642,,,,,,,,,,,,���J��,28969,,,,,,,,,,,,
122033,,�s��s,�M�\�ܑw��,�R�E�V���S�\�E�g�E,,,�s�w��L�`������,������,,122033,,��t���s��s���䒬3����654�q���_��,��t��,�s��s,���䒬3����,654,�q���_��,35.74486967,139.9639282,,,,,,,,,,,,�q���_��,28969,,,,,,,,,,,,
122033,,�s��s,�{������x������,�z���A�~�R�E�G�c�u���R�c�{,,,�s�w��L�`������,������,,122033,,��t���s��s���R2����10-1�@�،o����,��t��,�s��s,���R2����,10-1,�@�،o����,35.71971661,139.9476128,,,,,,,,,,,,�@�،o��,29125,,,,,,,,,,,,
122033,,�s��s,�^�Ԗ��t������@����ؒ���������y�ѕ掏,�}�}�}�����E�P���V���E�q�c�P�^���X�Y�L�i�K�����]�E�R�c�L�I���r�{�V,,,�s�w��L�`������,������,,122033,,��t���s��s�^��4����4-9,��t��,�s��s,�^��4����,4-9,,35.73849033,139.9094932,,,,,,,,,,,,�T��@,29125,,,,,,,,,,,,
122033,,�s��s,�S����Տo�y�ꊇ�╨,�I�j�^�J�C�Z�L�V���c�h�C�b�J�c�C�u�c,,,�s�w��L�`������,���p�H�|�i�E�l�Î���,,122033,,��t���s��s�x�V��2����26-1�l�Ô����ُ���,��t��,�s��s,�x�V��2����,26-1,�l�Ô����ُ���,35.75905389,139.9120709,,,,,,,,,,,,�s��s,29693,,,,,,,,,,,,
122033,,�s��s,�����a���߉ޔ@������,�h�E�]�E�^���W���E�V���J�j�����C�����E�]�E,,,���w��L�`������,���p�H�|�i�E����,,122033,,��t���s��s�x�V��2����26-1�l�Ô����ُ���,��t��,�s��s,�x�V��2����,26-1,�l�Ô����ُ���,35.75905389,139.9119475,,,,,,,,,,,,�s��s,44995,,,,,,,,,,,,
122033,,�s��s,��ߍ]����,���C�I�E�~�I�E�q,,,�s�w��L�`������,������,,122033,,��t���s��s�^��4����3-14,��t��,�s��s,�^��4����,3-14,,35.73916764,139.9098271,,,,,,,,,,,,�T��@,30020,,,,,,,,,,,,
122033,,�s��s,�u���[�g���򐫘_�v�Ŗ�,���[�g�����N�Z�C�����n���M,,,�s�w��L�`������,���j����,,122033,,��t���s��s�x�V��2����27-1���j�����ُ���,��t��,�s��s,�x�V��2����,27-1,���j�����ُ���,35.75975364,139.9116497,,,,,,,,,,,,�s��s,31719,,,,,,,,,,,,
122033,,�s��s,���莛�R��,�g�N�K���W�T������,,,�s�w��L�`������,������,,122033,,��t���s��s�{�s��5-22���莛,��t��,�s��s,�{�s��,5-22,���莛,35.69520608,139.9214782,,,,,,,,,,,,���莛,38070,,,,,,,,,,,,
122033,,�s��s,���莛���O,�g�N�K���W�V���E���E,,,�s�w��L�`������,������,,122033,,��t���s��s�{�s��5-22���莛,��t��,�s��s,�{�s��,5-22,���莛,35.69519517,139.9217169,,,,,,,,,,,,���莛,38070,,,,,,,,,,,,
122033,,�s��s,���莛�o��,�g�N�K���W�L���E�]�E,,,�s�w��L�`������,������,,122033,,��t���s��s�{�s��5-22���莛,��t��,�s��s,�{�s��,5-22,���莛,35.69533025,139.9215895,,,,,,,,,,,,���莛,38070,,,,,,,,,,,,
122033,,�s��s,�@�،o�������߉ޔ@������,�z�P�L���E�W�h�E�]�E�V���J�j�����C�U�]�E,,,�s�w��L�`������,���p�H�|�i�E����,,122033,,��t���s��s���R2����10-1�@�،o����,��t��,�s��s,���R2����,10-1,�@�،o����,35.72015142,139.9487214,,,,,,,,,,,,�@�،o��,43537,,,,,,,,,,,,
122033,,�s��s,�����h�H�R�Ԑl�`,�^�P�m�E�`�m�X�N�l�_�V�j���M���E,,,�s�w��d�v�L�`����������,�i���J��j,,122033,,��t���s��s�s��3����20-8�t���_��,��t��,�s��s,�s��3����,20-8,�t���_��,35.73504672,139.9023588,,,,,,,,,,,,�t���_��,42475,,,,,,,,,,,,
122033,,�s��s,����,�I�r�V��,,,�s�w��d�v���`����������,�i�Վ��j,,122033,,��t���s��s��쒬4����2758��`�_��,��t��,�s��s,��쒬4����,2758,��`�_��,35.760196,139.9617561,,,,,,,,,,,,��`�_�Ќ���,23803,,,,,,,,,,,,
122033,,�s��s,���{��Ґ؂�,�R�E�m�_�C�c�W�L��,,,�s�w��d�v���`����������,�i�Վ��j,,122033,,��t���s��s���{��3����11-1���{��V���{,��t��,�s��s,���{��3����,11-1,���{��V���{,35.749173,139.8989156,,,,,,,,,,,,���{��Ґ؂�ۑ���,28969,,,,,,,,,,,,
122033,,�s��s,���Z�֑��Ձ@B�n�_,�~�m���_�C�C�Z�L�r�[�`�e��,,,�s�w��j��,�i��Ձj,,122033,,��t���s��s�{�k��3����751�̈ꕔ,��t��,�s��s,�{�k��3����,751,�̈ꕔ,35.72807042,139.9516501,,,,,,,,,,,,�s��s,27402,,,,,,,,,,,,
122033,,�s��s,�{�a�c���,�X���_�C�Z�L,,,�s�w��j��,�i��Ձj,,122033,,��t���s��s�{�a�c2����34,��t��,�s��s,�{�a�c2����,34,,35.73992019,139.912922,,,,,,,,,,,,�s��s,27402,,,,,,,,,,,,
122033,,�s��s,�������А�,�V���E�T�\�E�W���A�g,,,�s�w��j��,�i��Ձj,,122033,,��t���s��s���{��1����6-4�X�|�[�c�Z���^�[,��t��,�s��s,���{��1����,6-4,�X�|�[�c�Z���^�[,35.74402511,139.9073736,,,,,,,,,,,,�s��s,27402,,,,,,,,,,,,
122033,,�s��s,�S�����,�I�j�^�J�C�Z�L,,,�s�w��j��,�i��Ձj,,122033,,��t���s��s�S��1����95-18,��t��,�s��s,�S��1����,95-18,,35.71387919,139.9350822,,,,,,,,,,,,���{�ѐD�i���j,32329,,,,,,,,,,,,
122033,,�s��s,�q���A�J�l,�q���A�J�l,,,�s�w��V�R�L�O��,�i�����j,,122033,,��t���s��s�咬284�咬�������R�ώ@��,��t��,�s��s,�咬,284,�咬�������R�ώ@��,35.77058819,139.970019,,,,,,,,,,,,�s��s,27923,,,,,,,,,,,,
122033,,�s��s,�q�k�}�C�g�g���{,�q�k�}�C�g�g���{,,,�s�w��V�R�L�O��,�i�����j,,122033,,��t���s��s�͌��A��זؒn��̍]�ː�݂͊̎��n��,��t��,�s��s,,,�͌��A��זؒn��̍]�ː�݂͊̎��n��,35.70426236,139.9228101,,,,,,,,,,,,�s��s,27923,,,,,,,,,,,,
122033,,�s��s,�ɜQ���_�Ѓn���M��,�C�U�i�M�W���W���n���M��,,,�s�w��V�R�L�O��,�i�A���j,,122033,,��t���s��s�x�V��4����26-1�ɜQ���_��,��t��,�s��s,�x�V��4����,26-1,�ɜQ���_��,35.7626825,139.9163988,,,,,,,,,,,,�ɜQ���_��,28969,,,,,,,,,,,,
122033,,�s��s,�����_�ЃC�`���E,�A�^�S�W���W���C�`���E,,,�s�w��V�R�L�O��,�i�A���j,,122033,,��t���s��s�k����1����12-24�����_��,��t��,�s��s,�k����1����,12-24,�����_��,35.7591455,139.9033642,,,,,,,,,,,,�����_��,30623,,,,,,,,,,,,
122033,,�s��s,�T�ƈ��}�L,�[���V���E�A���}�L,,,�s�w��V�R�L�O��,�i�A���j,,122033,,��t���s��s�k����4����13-23�T�ƈ�,��t��,�s��s,�k����4����,13-23,�T�ƈ�,35.76497814,139.9064236,,,,,,,,,,,,�T�ƈ�,30623,,,,,,,,,,,,
122033,,�s��s,���������_,���b�V���E�A���R�N����,,,���w�荑��,���p�H�|�i�E����,,122033,,��t���s��s���R2����10-1�@�،o����,��t��,�s��s,���R2����,10-1,�@�،o����,35.72078006,139.9491782,,,,,,,,,,,,�@�،o��,19082,,,,,,,,,,,,
122033,,�s��s,���i�{�����@���Y��@���t���R���G�,�J���W���z���]���V���E�c�P�^���\�G�W���E�c�P�^���J�X�K���}�}�L�G�o�R,,,���w�荑��,"���p�H�|�i�E����
���p�H�|�i�E����
���p�H�|�i�E�H�|�i",,122033,,��t���s��s���R2����10-1�@�،o����,��t��,�s��s,���R2����,10-1,�@�،o����,35.72068861,139.9492533,,,,,,,,,,,,�@�،o��,19082,,,,,,,,,,,,
122033,,�s��s,�@�،o���܏d��,�z�P�L���E�W�S�W���E�m�g�E,,,���w��d�v������,������,,122033,,��t���s��s���R2����10-1�@�،o��,��t��,�s��s,���R2����,10-1,�@�،o��,35.720006,139.9487149,,,,,,,,,,,,�@�،o��,5989,,,,,,,,,,,,
122033,,�s��s,�@�،o���@�ؓ��@�����D,�z�P�L���E�W�z�b�P�h�E�c�P�^�����i�t�_,,,���w��d�v������,������,,122033,,��t���s��s���R2����10-1�@�،o��,��t��,�s��s,���R2����,10-1,�@�،o��,35.72063317,139.9478325,,,,,,,,,,,,�@�،o��,5989,,,,,,,,,,,,���ɂ��Ă�S60.5.18�w��
122033,,�s��s,�@�،o���l����,�z�P�L���E�W�V�\�N����,,,���w��d�v������,������,,122033,,��t���s��s���R2����10-1�@�،o��,��t��,�s��s,���R2����,10-1,�@�،o��,35.72046767,139.9479746,,,,,,,,,,,,�@�،o��,5989,,,,,,,,,,,,S30.6.22�P�Ǝw��
122033,,�s��s,�@�،o���c�t���@�����D,�z�P�L���E�W�\�V�h�E�c�P�^�����i�t�_,,,���w��d�v������,������,,122033,,��t���s��s���R2����10-1�@�،o��,��t��,�s��s,���R2����,10-1,�@�،o��,35.72017586,139.9481865,,,,,,,,,,,,�@�،o��,31185,,,,,,,,,,,,
122033,,�s��s,���{���F�\�Z������,�P���|���`���N�V���N�W���E���N���J���]�E,,,���w��d�v������,���p�H�|�i�E�G��,,122033,,��t���s��s���R2����10-1�@�،o��,��t��,�s��s,���R2����,10-1,�@�،o��,35.72077678,139.9494008,,,,,,,,,,,,�@�،o��,1510,,,,,,,,,,,,
122033,,�s��s,���{���F���@���l��,�P���|���`���N�V���N�j�`�����V���E�j���]�E,,,���w��d�v������,���p�H�|�i�E�G��,,122033,,��t���s��s���R3����10-4����@,��t��,�s��s,���R3����,10-4,����@,35.71995808,139.9493345,,,,,,,,,,,,����@,19194,,,,,,,,,,,,
122033,,�s��s,���@���M�╶�@�����G������,�j�`�����W�q�c�C�u���c�P�^���}�L�G�V���E�M���E�o�R,,,���w��d�v������,���p�H�|�i�E����,,122033,,��t���s��s���R2����10-1�@�،o����,��t��,�s��s,���R2����,10-1,�@�،o����,35.72084103,139.9493378,,,,,,,,,,,,�@�،o��,24638,,,,,,,,,,,,���ɂ��Ă�H5.1.20�w��
122033,,�s��s,�x�V���L��,�z���m�E�`�J�C�d�J,,,���w��j��,�i�L�ˁj,,122033,,��t���s��s�x�V��2����15�ق�,��t��,�s��s,�x�V��2����,15,�ق�,35.75927986,139.9106647,,,,,,,,,,,,�s��s�ق�,23564,,,,,,,,,,,,S42.6.22�ǉ��w��
122033,,�s��s,�W�R�L��,�E�o���}�J�C�d�J,,,���w��j��,�i�L�ˁj,,122033,,��t���s��s���䒬1����1223�ق�,��t��,�s��s,���䒬1����,1223,�ق�,35.73761225,139.9652968,,,,,,,,,,,,�s��s,24701,,,,,,,,,,,,
122033,,�s��s,�����������Ձ@���k�����q��,�V���t�T�R�N�u���W�A�g�c�P�^���L�^�V�^�J�����K�}�A�g,,,���w��j��,�i��Ձj,,122033,,��t���s��s����3����20-1�ق�,��t��,�s��s,����3����,20-1,�ق�,35.74393881,139.9166686,,,,,,,,,,,,�s��s�ق�,24833,,,,,,,,,,,,H14.9.20�ǉ��w��A���ɂ��Ă�H22.8.5�w��
122033,,�s��s,���������򎛐�,�V���E�T�R�N�u���j�W�A�g,,,���w��j��,�i��Ձj,,122033,,��t���s��s����4����17-1�ق�,��t��,�s��s,����4����,17-1,�ق�,35.74643794,139.9132139,,,,,,,,,,,,�s��s�ق�,24833,,,,,,,,,,,,H1.3.29�ǉ��w��
122033,,�s��s,�]�J�L��,�\���J�C�d�J,,,���w��j��,�i�L�ˁj,,122033,,��t���s��s�]�J2����15,��t��,�s��s,�]�J2����,15,,35.74682886,139.9354526,,,,,,,,,,,,�s��s�ق�,29211,,,,,,,,,,,,H21.7.23�AH28.3.1�ǉ��w��
122033,,�s��s,��{������,�Z���{���C�`���E,,,���w��V�R�L�O��,�i�A���j,,122033,,��t���s��s����4����2-1���������{,��t��,�s��s,����4����,2-1,���������{,35.72412253,139.9312166,,,,,,,,,,,,���������{,11374,,,,,,,,,,,,
122033,,�s��s,����,�{���V���E,,,���w��L�`������,���p�H�|�i�E�H�|�i,,122033,,��t���s��s����4����2-1���������{,��t��,�s��s,����4����,2-1,���������{,35.72417694,139.931104,,,,,,,,,,,,���������{,21664,,,,,,,,,,,,
122033,,�s��s,�ؑ��߉ޔ@���E����@�������@�������[���i,���N�]�E�V���J�j�����C�E�^�z�E�j�����C�U�]�E�c�P�^���]�E�i�C�m�E�j���E�q��,,,���w��L�`������,���p�H�|�i�E����,,122033,,��t���s��s���R2����10-1�@�،o����,��t��,�s��s,���R2����,10-1,�@�،o����,35.72092161,139.9493016,,,,,,,,,,,,�@�،o��,35874,,,,,,,,,,,,
122033,,�s��s,���{���F�\��������,�P���|���`���N�V���N�W���E���Z�c�j���]�E,,,���w��L�`������,���p�H�|�i�E�G��,,122033,,��t���s��s���R3����10-4����@,��t��,�s��s,���R3����,10-4,����@,35.71981611,139.9494746,,,,,,,,,,,,����@,36581,,,,,,,,,,,,
122033,,�s��s,�ēc���^��A��z,�V�o�^�[�V���K�����N�K�N,,,���w��L�`������,���p�H�|�i�E�G��,,122033,,��t���s��s����1����15-2�����V�_��,��t��,�s��s,����1����,15-2,�����V�_��,35.72873336,139.9266048,,,,,,,,,,,,�����V�_��,38790,,,,,,,,,,,,
122033,,�s��s,�����@�����D����,�T�h�E�@�V�L�Z�C�I���x�����E,,,���w��d�v���`������,,,122033,,��t���s��s���{��3����8-2,��t��,�s��s,���{��3����,8-2,,35.74711575,139.9014551,,,,,,,,,,,,�D���j�[��,20438,,,,,,,,,,,,
122033,,�s��s,�{�a�c���,�X���_�C�Z�L,,,���w��j��,�i��Ձj,,122033,,��t���s��s�{�a�c2����34�{�a�c����,��t��,�s��s,�{�a�c2����,34,�{�a�c����,35.73897678,139.9124762,,,,,,,,,,,,�s��s,34387,,,,,,,,,,,,
122033,,�s��s,�S����Տo�y�i,�I�j�^�J�C�Z�L�V���c�h�q��,,,���w��L�`������,���p�H�|�i�E�l�Î���,,122033,,��t���s��s�x�V��2����26-1�l�Ô����ُ���,��t��,�s��s,�x�V��2����,26-1,�l�Ô����ُ���,35.75905389,139.9120709,,,,,,,,,,,,�s��s,44628,,,,,,,,,,,,
122033,,�s��s,���i�����@�`���i�j,�J�^�i�����C�f���J�l�i�K,,,���w��d�v������,���p�H�|�i�E�H�|�i,,122033,,��t���s��s,��t��,�s��s,,,,,,,,,,,,,,,,,�l��,20122,,,,,,,,,,,,
122033,,�s��s,���m�ً�y���i�n�ӉƏZ��j,�Z�C���E�J���N���u���^�i�x�P�W���E�^�N,,,���o�^�L�`������,������,,122033,,��t���s��s�V�c5����6-21,��t��,�s��s,�V�c5����,6-21,,35.72999754,139.9118578,,,,,,,,,,,,,36349,,,,,,,,,,,,
122033,,�s��s,���{�������[�e���s�싳��,��z���t�N�C�����[�e���C�`�J���L���E�J�C�J�C�h�E,,,���o�^�L�`������,������,,122033,,��t���s��s�s��4����1-5,��t��,�s��s,�s��4����,1-5,,35.73829432,139.9058304,,,,,,,,,,,,���{�������[�e������,39744,,,,,,,,,,,,
122033,,�s��s,�����ƏZ��@�剮,�J�g�E�P�W���E�^�N�V���I�N,,,���o�^�L�`������,������,,122033,,��t���s��s�{�s��6-1,��t��,�s��s,�{�s��,6-1,,35.69115753,139.9161432,,,,,,,,,,,,,40296,,,,,,,,,,,,
122033,,�s��s,�����ƏZ��@������,�J�g�E�P�W���E�^�N�����K�x�C,,,���o�^�L�`������,������,,122033,,��t���s��s�{�s��6-1,��t��,�s��s,�{�s��,6-1,,35.69112845,139.9160294,,,,,,,,,,,,,40296,,,,,,,,,,,,
122033,,�s��s,����q�_�`�X�@�X�܌��剮,�L���E�A�T�R�~�R�V�e���e���|�P���V���I�N,,,���o�^�L�`������,������,,122033,,��t���s��s�{�s��37-2,��t��,�s��s,�{�s��,37-2,,35.69044878,139.9154592,,,,,,,,,,,,�s��s,40431,,,,,,,,,,,,
122033,,�s��s,���a�w�@�n���L�O��,�V���E���K�N�C���\�E���c�L�l���J��,,,���o�^�L�`������,������,,122033,,��t���s��s������2����1-9,��t��,�s��s,������2����,1-9,,35.73463253,139.9311373,,,,,,,,,,,,�w�Z�@�l���a�w�@,40569,,,,,,,,,,,,
122033,,�s��s,�����ƏZ��剮,�i�J�����P�W���E�^�N�V���I�N,,,���o�^�L�`������,������,,122033,,��t���s��s�S�z2����200-1��,��t��,�s��s,�S�z2����,200-1��,,35.71688825,139.940857,,,,,,,,,,,,,41919,,,,,,,,,,,,
122033,,�s��s,�����ƏZ���,�i�J�����P�W���E�^�N�n�i��,,,���o�^�L�`������,������,,122033,,��t���s��s�S�z2����200-2,��t��,�s��s,�S�z2����,200-2,,35.71680928,139.9408146,,,,,,,,,,,,,41919,,,,,,,,,,,,
122033,,�s��s,�����ƏZ�������,�i�J�����P�W���E�^�N�����K�O��,,,���o�^�L�`������,������,,122033,,��t���s��s�S�z2����200-1,��t��,�s��s,�S�z2����,200-1,,35.71701835,139.9407684,,,,,,,,,,,,,41919,,,,,,,,,,,,
122033,,�s��s,�����ƏZ��y��,�i�J�����P�W���E�^�N�h�]�E,,,���o�^�L�`������,������,,122033,,��t���s��s�S�z2����200-2,��t��,�s��s,�S�z2����,200-2,,35.71681,139.9409296,,,,,,,,,,,,,41919,,,,,,,,,,,,
122033,,�s��s,�����ƏZ��k���y�ю�����,�i�J�����P�W���E�^�N�L�^�O���I���r�W���V��,,,���o�^�L�`������,������,,122033,,��t���s��s�S�z2����200-1,��t��,�s��s,�S�z2����,200-1,,35.71693418,139.9410317,,,,,,,,,,,,,41919,,,,,,,,,,,,
122033,,�s��s,�����ƏZ��q��,�i�J�����P�W���E�^�N�\�E�R,,,���o�^�L�`������,������,,122033,,��t���s��s�S�z2����200-2,��t��,�s��s,�S�z2����,200-2,,35.71651877,139.9408152,,,,,,,,,,,,,41919,,,,,,,,,,,,
122033,,�s��s,�����ƏZ���׎�,�i�J�����P�W���E�^�N�C�i���V��,,,���o�^�L�`������,������,,122033,,��t���s��s�S�z2����200-3,��t��,�s��s,�S�z2����,200-3,,35.71665891,139.940552,,,,,,,,,,,,,41919,,,,,,,,,,,,
122033,,�s��s,�����ƏZ��h��,�i�J�����P�W���E�^�N�{�E�N�E�S�E,,,���o�^�L�`������,������,,122033,,��t���s��s�S�z2����200-3,��t��,�s��s,�S�z2����,200-3,,35.7167494,139.9405945,,,,,,,,,,,,,41919,,,,,,,,,,,,
122033,,�s��s,�����ƏZ���y�ѐΕ�,�i�J�����P�W���E�^�N�����I���r�C�V�x�C,,,���o�^�L�`������,������,,122033,,��t���s��s�S�z2����200-1,��t��,�s��s,�S�z2����,200-1,,35.71698444,139.9409581,,,,,,,,,,,,,41919,,,,,,,,,,,,
122033,,�s��s,�㓡�ƏZ��剮,�S�g�E�P�W���E�^�N�V���I�N,,,���o�^�L�`������,������,,122033,,��t���s��s�V�c1����296,��t��,�s��s,�V�c1����,296,,35.72650575,139.9167351,,,,,,,,,,,,,42914,,,,,,,,,,,,
122033,,�s��s,�㓡�ƏZ���׎�,�S�g�E�P�W���E�^�N�C�i���V��,,,���o�^�L�`������,������,,122033,,��t���s��s�V�c1����296-1,��t��,�s��s,�V�c1����,296-1,,35.72675207,139.916951,,,,,,,,,,,,,42914,,,,,,,,,,,,
122033,,�s��s,������O�Y�ƏZ��,�V�L�o�����E�U�u���E�P�W���E�^�N,,,���o�^�L�`������,������,,122033,,��t���s��s���{��6����2412,��t��,�s��s,���{��6����,2412,,35.75572714,139.9030435,,,,,,,,,,,,,44483,,,,,,,,,,,,
